BDBM50001412 3,7,7-trimethyl-1-spiro[1H-indene-1,4'-(hexahydropyridine)]-1-ylsulfonylmethylbicyclo[2.2.1]heptan-2-one::CHEMBL127063
SMILES CC1C2CC[C@@](CS(=O)(=O)N3CCC4(CC3)C=Cc3ccccc43)(C1=O)C2(C)C
InChI Key InChIKey=ZIKSQYXDYRQMMQ-VWLBVBLESA-N
Data  3 IC50
  Tab Delimited (TSV)   2D SDfile   Computed 3D by Vconf -m prep SDfile
Find this compound or compounds like it in BindingDB:
Activity Spreadsheet -- Enzyme Inhibition Constant Data from BindingDB
Found 2 hits for monomerid = 50001412
TargetVasopressin V1a/V1b/V2 receptor(RAT)
Merck Research Laboratories
Curated by ChEMBL
LigandPNGBDBM50001412(3,7,7-trimethyl-1-spiro[1H-indene-1,4'-(hexahydrop...)
Affinity DataIC50: >1.00E+4nM. Assay description: Half-maximal inhibition of binding of [3H]- vasopressin to the vasopressin receptor 2 in rat kidney
In DepthDetails ArticlePubMed
TargetVasopressin V1a/V1b/V2 receptor(RAT)
Merck Research Laboratories
Curated by ChEMBL
LigandPNGBDBM50001412(3,7,7-trimethyl-1-spiro[1H-indene-1,4'-(hexahydrop...)
Affinity DataIC50:  1.00E+4nM. Assay description: Half-maximal inhibition of binding of [3H]vasopressin to vasopressin receptor 1 in rat liver
In DepthDetails ArticlePubMed